{"text_format":"1","workbook":"xlsx","n_sheets":3,"sheets":["NUMERAÇÃO","GESTÃO DE CONTRATOS","2018"],"not_rendered":{"charts":0,"images":0,"macros":0,"external_links":1,"defined_names":26,"comments":1,"pivot_tables":0},"unopened":[],"bounds":{"document_bytes":16777216,"sheet_cells":100000,"rows_first":2000,"rows_last":500,"rows_between":2000,"halvings":0,"cell_chars":16384,"cell_head_chars":4096},"cells_cut":0,"cells_raw":0,"read":"whole","date_system":"1900"}

{"sheet":"NUMERAÇÃO","index":0,"n_rows":72,"n_cols":14,"rows_kept":72,"cut":false,"hidden":true,"merged":[[0,0,0,1],[0,3,0,4],[0,6,0,7],[0,9,0,10],[0,12,0,13]]}
["PROC. ADM",null,null,"ATA",null,null,"CONTRATOS",null,null,"OS",null,null,"OF"]
["NUMERO","LICITAÇÃO",null,"NUMERO","LICITAÇÃO",null,"NUMERO","LICITAÇÃO",null,"NUMERO","LICITAÇÃO",null,"NUMERO","LICITAÇÃO"]
["001/15",{"$f":"IFERROR(CONCATENATE(VLOOKUP(A3,'2018'!$A$1:$U$99958,3,),TEXT(VLOOKUP(A3,'2018'!$A$1:$U$99958,2,),\"000\"),\"/\",YEAR(VLOOKUP(A3,'2018'!$A$1:$U$99958,4,))),\"\")","v":""},null,"001/15","PP019/14",null,"001/15","TP06/2014",null,"001/15","CV054/2014",null,"001/15","CV002"]
["002/15",{"$f":"IFERROR(CONCATENATE(VLOOKUP(A4,'2018'!$A$1:$U$99958,3,),TEXT(VLOOKUP(A4,'2018'!$A$1:$U$99958,2,),\"000\"),\"/\",YEAR(VLOOKUP(A4,'2018'!$A$1:$U$99958,4,))),\"\")","v":""},null,"002/15","PP019/14",null,"002/15","PP18/2014",null,"002/15","CV055/2014",null,"002/15"]
["003/15",{"$f":"IFERROR(CONCATENATE(VLOOKUP(A5,'2018'!$A$1:$U$99958,3,),TEXT(VLOOKUP(A5,'2018'!$A$1:$U$99958,2,),\"000\"),\"/\",YEAR(VLOOKUP(A5,'2018'!$A$1:$U$99958,4,))),\"\")","v":""},null,"003/15","PP019/14",null,"003/15","PP001",null,"003/15","CV056/2014",null,"003/15"]
["004/15",{"$f":"IFERROR(CONCATENATE(VLOOKUP(A6,'2018'!$A$1:$U$99958,3,),TEXT(VLOOKUP(A6,'2018'!$A$1:$U$99958,2,),\"000\"),\"/\",YEAR(VLOOKUP(A6,'2018'!$A$1:$U$99958,4,))),\"\")","v":""},null,"004/15","PP020/14",null,"004/15","PP002",null,"004/15","CV057/2014",null,"004/15"]
["005/15",{"$f":"IFERROR(CONCATENATE(VLOOKUP(A7,'2018'!$A$1:$U$99958,3,),TEXT(VLOOKUP(A7,'2018'!$A$1:$U$99958,2,),\"000\"),\"/\",YEAR(VLOOKUP(A7,'2018'!$A$1:$U$99958,4,))),\"\")","v":""},null,"005/15","PP020/14",null,"005/15","TP05/2014",null,"005/15","CV001",null,"005/15"]
["006/15",{"$f":"IFERROR(CONCATENATE(VLOOKUP(A8,'2018'!$A$1:$U$99958,3,),TEXT(VLOOKUP(A8,'2018'!$A$1:$U$99958,2,),\"000\"),\"/\",YEAR(VLOOKUP(A8,'2018'!$A$1:$U$99958,4,))),\"\")","v":""},null,"006/15","PP021/14",null,"006/15","PP003",null,"006/15","CV003",null,"006/15"]
["007/15",{"$f":"IFERROR(CONCATENATE(VLOOKUP(A9,'2018'!$A$1:$U$99958,3,),TEXT(VLOOKUP(A9,'2018'!$A$1:$U$99958,2,),\"000\"),\"/\",YEAR(VLOOKUP(A9,'2018'!$A$1:$U$99958,4,))),\"\")","v":""},null,"007/15","PP021/14",null,"007/15","IN001",null,"007/15","CV004",null,"007/15"]
["008/15",{"$f":"IFERROR(CONCATENATE(VLOOKUP(A10,'2018'!$A$1:$U$99958,3,),TEXT(VLOOKUP(A10,'2018'!$A$1:$U$99958,2,),\"000\"),\"/\",YEAR(VLOOKUP(A10,'2018'!$A$1:$U$99958,4,))),\"\")","v":""},null,"008/15","PP001/15",null,"008/15","PP004",null,"008/15","CV005",null,"008/15"]
["009/15",{"$f":"IFERROR(CONCATENATE(VLOOKUP(A11,'2018'!$A$1:$U$99958,3,),TEXT(VLOOKUP(A11,'2018'!$A$1:$U$99958,2,),\"000\"),\"/\",YEAR(VLOOKUP(A11,'2018'!$A$1:$U$99958,4,))),\"\")","v":""},null,"009/15","PP002/15",null,"009/15",null,null,"009/15","CV006",null,"009/15"]
["010/15",{"$f":"IFERROR(CONCATENATE(VLOOKUP(A12,'2018'!$A$1:$U$99958,3,),TEXT(VLOOKUP(A12,'2018'!$A$1:$U$99958,2,),\"000\"),\"/\",YEAR(VLOOKUP(A12,'2018'!$A$1:$U$99958,4,))),\"\")","v":""},null,"010/15",null,null,"010/15",null,null,"010/15",null,null,"010/15"]
["011/15",{"$f":"IFERROR(CONCATENATE(VLOOKUP(A13,'2018'!$A$1:$U$99958,3,),TEXT(VLOOKUP(A13,'2018'!$A$1:$U$99958,2,),\"000\"),\"/\",YEAR(VLOOKUP(A13,'2018'!$A$1:$U$99958,4,))),\"\")","v":""},null,"011/15",null,null,"011/15",null,null,"011/15",null,null,"011/15"]
["012/15",{"$f":"IFERROR(CONCATENATE(VLOOKUP(A14,'2018'!$A$1:$U$99958,3,),TEXT(VLOOKUP(A14,'2018'!$A$1:$U$99958,2,),\"000\"),\"/\",YEAR(VLOOKUP(A14,'2018'!$A$1:$U$99958,4,))),\"\")","v":""},null,"012/15",null,null,"012/15",null,null,"012/15",null,null,"012/15"]
["013/15",{"$f":"IFERROR(CONCATENATE(VLOOKUP(A15,'2018'!$A$1:$U$99958,3,),TEXT(VLOOKUP(A15,'2018'!$A$1:$U$99958,2,),\"000\"),\"/\",YEAR(VLOOKUP(A15,'2018'!$A$1:$U$99958,4,))),\"\")","v":""},null,"013/15",null,null,"013/15",null,null,"013/15",null,null,"013/15"]
["014/15",{"$f":"IFERROR(CONCATENATE(VLOOKUP(A16,'2018'!$A$1:$U$99958,3,),TEXT(VLOOKUP(A16,'2018'!$A$1:$U$99958,2,),\"000\"),\"/\",YEAR(VLOOKUP(A16,'2018'!$A$1:$U$99958,4,))),\"\")","v":""},null,"014/15",null,null,"014/15",null,null,"014/15",null,null,"014/15"]
["015/15",{"$f":"IFERROR(CONCATENATE(VLOOKUP(A17,'2018'!$A$1:$U$99958,3,),TEXT(VLOOKUP(A17,'2018'!$A$1:$U$99958,2,),\"000\"),\"/\",YEAR(VLOOKUP(A17,'2018'!$A$1:$U$99958,4,))),\"\")","v":""},null,"015/15",null,null,"015/15",null,null,"015/15",null,null,"015/15"]
["016/15",{"$f":"IFERROR(CONCATENATE(VLOOKUP(A18,'2018'!$A$1:$U$99958,3,),TEXT(VLOOKUP(A18,'2018'!$A$1:$U$99958,2,),\"000\"),\"/\",YEAR(VLOOKUP(A18,'2018'!$A$1:$U$99958,4,))),\"\")","v":""},null,"016/15",null,null,"016/15",null,null,"016/15",null,null,"016/15"]
["017/15",{"$f":"IFERROR(CONCATENATE(VLOOKUP(A19,'2018'!$A$1:$U$99958,3,),TEXT(VLOOKUP(A19,'2018'!$A$1:$U$99958,2,),\"000\"),\"/\",YEAR(VLOOKUP(A19,'2018'!$A$1:$U$99958,4,))),\"\")","v":""},null,"017/15",null,null,"017/15",null,null,"017/15",null,null,"017/15"]
["018/15",{"$f":"IFERROR(CONCATENATE(VLOOKUP(A20,'2018'!$A$1:$U$99958,3,),TEXT(VLOOKUP(A20,'2018'!$A$1:$U$99958,2,),\"000\"),\"/\",YEAR(VLOOKUP(A20,'2018'!$A$1:$U$99958,4,))),\"\")","v":""},null,"018/15",null,null,"018/15",null,null,"018/15",null,null,"018/15"]
["019/15",{"$f":"IFERROR(CONCATENATE(VLOOKUP(A21,'2018'!$A$1:$U$99958,3,),TEXT(VLOOKUP(A21,'2018'!$A$1:$U$99958,2,),\"000\"),\"/\",YEAR(VLOOKUP(A21,'2018'!$A$1:$U$99958,4,))),\"\")","v":""},null,"019/15",null,null,"019/15",null,null,"019/15",null,null,"019/15"]
["020/15",{"$f":"IFERROR(CONCATENATE(VLOOKUP(A22,'2018'!$A$1:$U$99958,3,),TEXT(VLOOKUP(A22,'2018'!$A$1:$U$99958,2,),\"000\"),\"/\",YEAR(VLOOKUP(A22,'2018'!$A$1:$U$99958,4,))),\"\")","v":""},null,"020/15",null,null,"020/15",null,null,"020/15",null,null,"020/15"]
["021/15",{"$f":"IFERROR(CONCATENATE(VLOOKUP(A23,'2018'!$A$1:$U$99958,3,),TEXT(VLOOKUP(A23,'2018'!$A$1:$U$99958,2,),\"000\"),\"/\",YEAR(VLOOKUP(A23,'2018'!$A$1:$U$99958,4,))),\"\")","v":""},null,"021/15",null,null,"021/15",null,null,"021/15",null,null,"021/15"]
["022/15",{"$f":"IFERROR(CONCATENATE(VLOOKUP(A24,'2018'!$A$1:$U$99958,3,),TEXT(VLOOKUP(A24,'2018'!$A$1:$U$99958,2,),\"000\"),\"/\",YEAR(VLOOKUP(A24,'2018'!$A$1:$U$99958,4,))),\"\")","v":""},null,"022/15",null,null,"022/15",null,null,"022/15",null,null,"022/15"]
["023/15",{"$f":"IFERROR(CONCATENATE(VLOOKUP(A25,'2018'!$A$1:$U$99958,3,),TEXT(VLOOKUP(A25,'2018'!$A$1:$U$99958,2,),\"000\"),\"/\",YEAR(VLOOKUP(A25,'2018'!$A$1:$U$99958,4,))),\"\")","v":""},null,"023/15",null,null,"023/15",null,null,"023/15",null,null,"023/15"]
["024/15",{"$f":"IFERROR(CONCATENATE(VLOOKUP(A26,'2018'!$A$1:$U$99958,3,),TEXT(VLOOKUP(A26,'2018'!$A$1:$U$99958,2,),\"000\"),\"/\",YEAR(VLOOKUP(A26,'2018'!$A$1:$U$99958,4,))),\"\")","v":""},null,"024/15",null,null,"024/15",null,null,"024/15",null,null,"024/15"]
["025/15",{"$f":"IFERROR(CONCATENATE(VLOOKUP(A27,'2018'!$A$1:$U$99958,3,),TEXT(VLOOKUP(A27,'2018'!$A$1:$U$99958,2,),\"000\"),\"/\",YEAR(VLOOKUP(A27,'2018'!$A$1:$U$99958,4,))),\"\")","v":""},null,"025/15",null,null,"025/15",null,null,"025/15",null,null,"025/15"]
["026/15",{"$f":"IFERROR(CONCATENATE(VLOOKUP(A28,'2018'!$A$1:$U$99958,3,),TEXT(VLOOKUP(A28,'2018'!$A$1:$U$99958,2,),\"000\"),\"/\",YEAR(VLOOKUP(A28,'2018'!$A$1:$U$99958,4,))),\"\")","v":""},null,"026/15",null,null,"026/15",null,null,"026/15",null,null,"026/15"]
["027/15",{"$f":"IFERROR(CONCATENATE(VLOOKUP(A29,'2018'!$A$1:$U$99958,3,),TEXT(VLOOKUP(A29,'2018'!$A$1:$U$99958,2,),\"000\"),\"/\",YEAR(VLOOKUP(A29,'2018'!$A$1:$U$99958,4,))),\"\")","v":""},null,"027/15",null,null,"027/15",null,null,"027/15",null,null,"027/15"]
["028/15",{"$f":"IFERROR(CONCATENATE(VLOOKUP(A30,'2018'!$A$1:$U$99958,3,),TEXT(VLOOKUP(A30,'2018'!$A$1:$U$99958,2,),\"000\"),\"/\",YEAR(VLOOKUP(A30,'2018'!$A$1:$U$99958,4,))),\"\")","v":""},null,"028/15",null,null,"028/15",null,null,"028/15",null,null,"028/15"]
["029/15",{"$f":"IFERROR(CONCATENATE(VLOOKUP(A31,'2018'!$A$1:$U$99958,3,),TEXT(VLOOKUP(A31,'2018'!$A$1:$U$99958,2,),\"000\"),\"/\",YEAR(VLOOKUP(A31,'2018'!$A$1:$U$99958,4,))),\"\")","v":""},null,"029/15",null,null,"029/15",null,null,"029/15",null,null,"029/15"]
["030/15",{"$f":"IFERROR(CONCATENATE(VLOOKUP(A32,'2018'!$A$1:$U$99958,3,),TEXT(VLOOKUP(A32,'2018'!$A$1:$U$99958,2,),\"000\"),\"/\",YEAR(VLOOKUP(A32,'2018'!$A$1:$U$99958,4,))),\"\")","v":""},null,"030/15",null,null,"030/15",null,null,"030/15",null,null,"030/15"]
["031/15",{"$f":"IFERROR(CONCATENATE(VLOOKUP(A33,'2018'!$A$1:$U$99958,3,),TEXT(VLOOKUP(A33,'2018'!$A$1:$U$99958,2,),\"000\"),\"/\",YEAR(VLOOKUP(A33,'2018'!$A$1:$U$99958,4,))),\"\")","v":""},null,"031/15",null,null,"031/15",null,null,"031/15",null,null,"031/15"]
["032/15",{"$f":"IFERROR(CONCATENATE(VLOOKUP(A34,'2018'!$A$1:$U$99958,3,),TEXT(VLOOKUP(A34,'2018'!$A$1:$U$99958,2,),\"000\"),\"/\",YEAR(VLOOKUP(A34,'2018'!$A$1:$U$99958,4,))),\"\")","v":""},null,"032/15",null,null,"032/15",null,null,"032/15",null,null,"032/15"]
["033/15",{"$f":"IFERROR(CONCATENATE(VLOOKUP(A35,'2018'!$A$1:$U$99958,3,),TEXT(VLOOKUP(A35,'2018'!$A$1:$U$99958,2,),\"000\"),\"/\",YEAR(VLOOKUP(A35,'2018'!$A$1:$U$99958,4,))),\"\")","v":""},null,"033/15",null,null,"033/15",null,null,"033/15",null,null,"033/15"]
["034/15",{"$f":"IFERROR(CONCATENATE(VLOOKUP(A36,'2018'!$A$1:$U$99958,3,),TEXT(VLOOKUP(A36,'2018'!$A$1:$U$99958,2,),\"000\"),\"/\",YEAR(VLOOKUP(A36,'2018'!$A$1:$U$99958,4,))),\"\")","v":""},null,"034/15",null,null,"034/15",null,null,"034/15",null,null,"034/15"]
["035/15",{"$f":"IFERROR(CONCATENATE(VLOOKUP(A37,'2018'!$A$1:$U$99958,3,),TEXT(VLOOKUP(A37,'2018'!$A$1:$U$99958,2,),\"000\"),\"/\",YEAR(VLOOKUP(A37,'2018'!$A$1:$U$99958,4,))),\"\")","v":""},null,"035/15",null,null,"035/15",null,null,"035/15",null,null,"035/15"]
["036/15",{"$f":"IFERROR(CONCATENATE(VLOOKUP(A38,'2018'!$A$1:$U$99958,3,),TEXT(VLOOKUP(A38,'2018'!$A$1:$U$99958,2,),\"000\"),\"/\",YEAR(VLOOKUP(A38,'2018'!$A$1:$U$99958,4,))),\"\")","v":""},null,"036/15",null,null,"036/15",null,null,"036/15",null,null,"036/15"]
["037/15",{"$f":"IFERROR(CONCATENATE(VLOOKUP(A39,'2018'!$A$1:$U$99958,3,),TEXT(VLOOKUP(A39,'2018'!$A$1:$U$99958,2,),\"000\"),\"/\",YEAR(VLOOKUP(A39,'2018'!$A$1:$U$99958,4,))),\"\")","v":""},null,"037/15",null,null,"037/15",null,null,"037/15",null,null,"037/15"]
["038/15",{"$f":"IFERROR(CONCATENATE(VLOOKUP(A40,'2018'!$A$1:$U$99958,3,),TEXT(VLOOKUP(A40,'2018'!$A$1:$U$99958,2,),\"000\"),\"/\",YEAR(VLOOKUP(A40,'2018'!$A$1:$U$99958,4,))),\"\")","v":""},null,"038/15",null,null,"038/15",null,null,"038/15",null,null,"038/15"]
{"$rows_left_out":33}
{"sheet":"GESTÃO DE CONTRATOS","index":1,"n_rows":1175,"n_cols":21,"rows_kept":1175,"cut":false,"hidden":true,"merged":[[1,11,1,12],[0,0,0,12],[0,13,0,19],[39,0,39,12],[7,2,9,2],[7,3,9,3],[7,11,9,11],[7,12,9,12],[10,2,11,2],[10,3,11,3],[12,2,13,2],[12,3,13,3]]}
["CONTRATOS",null,null,null,null,null,null,null,null,null,null,null,null,"ADITIVOS"]
["PROCESSO","INST.","LICITAÇÃO","OBJETO","CREDOR","VIG. (DIAS)","ASSINATURA","INÍCIO","TÉRMINO","STATUS","VALOR R$","PUBLICAÇÃO",null,"ADITIVO","ASSINT.","INÍCIO","TÉRMINO","STATUS","PUBLICAÇÃO","DATA LIMITE","FIM"]
["139/14",{"$f":"IF(A3<>\"\",VLOOKUP(A3,'2018'!$A$1:$U$99958,10,),\"\")","v":{"$error":"#N/A"}},{"$f":"IF(A3<>\"\",CONCATENATE(VLOOKUP(A3,'2018'!$A$1:$U$99958,3,),TEXT(VLOOKUP(A3,'2018'!$A$1:$U$99958,2,),\"000\"),\"/\",TEXT(VLOOKUP(A3,'2018'!$A$1:$U$99958,4,),\"aa\")),\"\")","v":{"$error":"#N/A"}},{"$f":"IF(A3<>\"\",VLOOKUP(A3,'2018'!$A$1:$U$99958,5,),\"\")","v":{"$error":"#N/A"}},{"$f":"IF(A3<>\"\",IF(VLOOKUP(A3,'2018'!$A$1:$U$99958,7,)=\"\",\"\",VLOOKUP(A3,'2018'!$A$1:$U$99958,7,)),\"\")","v":{"$error":"#N/A"}},{"$f":"IF(A3<>\"\",IF(VLOOKUP(A3,'2018'!$A$1:$U$99958,13,)=\"\",\"\",VLOOKUP(A3,'2018'!$A$1:$U$99958,13,)),\"\")","v":{"$error":"#N/A"}},{"$f":"IF(A3<>\"\",IF(VLOOKUP(A3,'2018'!$A$1:$U$99958,11,)=\"\",\"\",VLOOKUP(A3,'2018'!$A$1:$U$99958,11,)),\"\")","v":{"$error":"#N/A"}},{"$f":"IF(A3<>\"\",IF(VLOOKUP(A3,'2018'!$A$1:$U$99958,11,)=\"\",\"\",VLOOKUP(A3,'2018'!$A$1:$U$99958,11,)),\"\")","v":{"$error":"#N/A"}},{"$f":"IF(H3<>\"\",H3+F3,\"\")","v":{"$error":"#N/A"}},{"$f":"IF(U3=\"\",IF(I3=\"\",\"\",IF(N3<>\"\",\">>\",IF(AND(DAYS360(TODAY(),I3)<31,DAYS360(TODAY(),I3)>0),CONCATENATE(\"EXPIRANDO (\",DAYS360(TODAY(),I3),\")\"),IF(DAYS360(TODAY(),I3)>30,\"VIGENTE\",IF(OR(DAYS360(TODAY(),I3)=0,DAYS360(TODAY(),I3)<0),\"EXPIRADO\"))))),\"CONCLUÍDO\")","v":{"$error":"#N/A"}},{"$f":"IF(A3<>\"\",IF(VLOOKUP(A3,'2018'!$A$1:$U$99958,8,)=\"\",\"\",VLOOKUP(A3,'2018'!$A$1:$U$99958,8,)),\"\")","v":{"$error":"#N/A"}},{"$f":"IF(A3<>\"\",IF(VLOOKUP(A3,'2018'!$A$1:$U$99958,15,)=\"\",\"\",VLOOKUP(A3,'2018'!$A$1:$U$99958,15,)),\"\")","v":{"$error":"#N/A"}},{"$f":"IFERROR(DAYS360(L3,WORKDAY(EOMONTH(G3,0),5,#REF!)),\"\")","v":""},null,null,null,{"$f":"IF(P3<>\"\",P3+F3,\"\")","v":""},{"$f":"IF(Q3=\"\",\"\",IF(AND(DAYS360(TODAY(),Q3)<31,DAYS360(TODAY(),Q3)>0),\"EXPIRANDO\",IF(DAYS360(TODAY(),Q3)>30,\"VIGENTE\",IF(OR(DAYS360(TODAY(),Q3)=0,DAYS360(TODAY(),Q3)<0),\"EXPIRADO\"))))","v":""},null,{"$f":"IF(OR(O3=\"\",S3<>\"\"),\"\",WORKDAY(EOMONTH(O3,0),5,#REF!))","v":""}]
[]
[]
[]
[]
[]
[]
[]
[]
[]
[]
[]
[]
[]
[]
[]
[]
[]
[]
[]
[]
[]
[]
[]
[]
[]
[]
[]
[]
[]
[]
[]
[]
[]
[]
[]
[]
[]
{"$rows_left_out":1136}
{"sheet":"2018","index":2,"n_rows":91,"n_cols":12,"rows_kept":91,"cut":false,"hidden":false,"merged":[[26,0,26,1],[83,0,83,1],[84,0,84,1],[85,0,85,1],[28,0,28,1],[30,0,30,1],[32,0,32,1],[75,0,75,1],[76,0,76,1],[77,0,77,1],[78,0,78,1],[44,0,44,1],[45,0,45,1],[46,0,46,1],[79,0,79,1],[80,0,80,1],[43,0,43,1],[88,0,88,1],[89,0,89,1],[11,0,11,1],[12,0,12,1],[13,0,13,1],[16,0,16,1],[37,0,37,1],[38,0,38,1],[58,0,58,1],[59,0,59,1],[60,0,60,1],[33,0,33,1],[34,0,34,1],[35,0,35,1],[25,0,25,1],[68,0,68,1],[9,0,9,1],[29,0,29,1],[31,0,31,1],[40,0,40,1],[39,0,39,1],[24,0,24,1],[47,0,47,1],[18,0,18,1],[22,0,22,1],[14,0,14,1],[55,0,55,1],[20,0,20,1],[21,0,21,1],[41,0,41,1],[42,0,42,1],[57,0,57,1],[62,0,62,1],[61,0,61,1],[66,0,66,1],[67,0,67,1],[54,0,54,1],[51,0,51,1],[50,0,50,1],[52,0,52,1],[56,0,56,1],[6,0,6,1],[8,0,8,1],[63,0,63,1],[64,0,64,1],[65,0,65,1],[27,0,27,1],[53,0,53,1],[10,0,10,1],[23,0,23,1],[15,0,15,1],[7,0,7,1],[17,0,17,1],[48,0,48,1],[49,0,49,1],[36,0,36,1],[19,0,19,1],[90,0,90,1],[69,0,69,1],[87,0,87,1],[86,0,86,1],[73,0,73,1],[82,0,82,1],[70,0,70,1],[71,0,71,1],[72,0,72,1],[74,0,74,1],[81,0,81,1],[0,12,0,13],[0,0,1,9],[4,3,5,3],[4,0,5,0],[4,2,5,2],[3,6,3,9],[4,8,4,9],[3,0,3,5],[4,6,5,6],[3,11,5,11],[4,10,5,10],[4,7,5,7],[4,5,5,5],[4,4,5,4]]}
["ADITIVOS CONTINUADOS 2024 "]
[]
[]
[null,null,null,null,null,null,"CONTRATO / OS / OF"]
["DATA",null,"OBJETO","ÓRGÃO","VENCEDOR","VR ADTVDO","Nº","ASSINATURA","PRAZOS (DIAS)",null,"VALOR"]
[null,null,null,null,null,null,null,null,"EXECUÇÃO","VIGÊNCIA"]
["Inexig 01/2021",null,"PEGE - GESTÃO ESCOLAR","EDUC","INFATEC COM. E SERV. TEC EIRELE","12 meses","022/2021","2021-02-08","2023-11-23","2024-11-23","268.710,00               20.670,00 mensal ","5º ADITIVO TEMPO"]
["Adesão 002/2021",null,"Iluminação Pública","ADM","W A S EMPREENDIMENTOS E SERVIÇOS EIRELI","12 MESES","18/2021","2021-02-10","2021-12-30","2022-11-21",1216707.76,"1º ADITIVO TEMPO"]
["Adesão 002/2021",null,"Iluminação Pública","ADM","W A S EMPREENDIMENTOS E SERVIÇOS EIRELI","12 MESES","18/2021","2021-02-10","2022-11-21","2023-10-11",1216707.76,"2º ADITIVO TEMPO"]
["Adesão 002/2021",null,"Iluminação Pública","ADM","W A S EMPREENDIMENTOS E SERVIÇOS EIRELI","12 MESES","18/2021","2021-02-10","2023-10-11","2024-10-11",1216707.76,"3º ADITIVO TEMPO"]
["Adesão 002/2021",null,"Iluminação Pública","ADM","W A S EMPREENDIMENTOS E SERVIÇOS EIRELI","12 MESES","18/2021","2021-02-10","2024-10-11","2024-12-31",1216707.76,"3º ADITIVO TEMPO"]
["TP 07/2021",null,"CONTROLE INTERNO","ADM","ATIVA ASSES. E CONSULTORIA CONTABIL LTDA","12 MESES","90/2021","2021-06-16","2021-12-30","2022-07-18","56.000,00                   8.000,00 mensal","1º ADITIVO TEMPO"]
["TP 07/2021",null,"CONTROLE INTERNO","ADM","ATIVA ASSES. E CONSULTORIA CONTABIL LTDA","12 MESES","90/2021","2021-06-16","2022-07-18","2023-02-02","56.000,00                  8.000,00 mensal","2º ADITIVO TEMPO"]
["TP 07/2021",null,"CONTROLE INTERNO","ADM","ATIVA ASSES. E CONSULTORIA CONTABIL LTDA","12 MESES","90/2021","2021-06-16","2023-02-02","2023-08-19","56.000,00 8.000,00 mensal","3º ADITIVO TEMPO"]
["TP 07/2021",null,"CONTROLE INTERNO","ADM","ATIVA ASSES. E CONSULTORIA CONTABIL LTDA","12 MESES","90/2021","2021-06-16","2023-08-18","2024-08-18","56.000,00                  8.000,00 mensal","4º ADITIVO TEMPO"]
["TP 07/2021",null,"CONTROLE INTERNO","ADM","ATIVA ASSES. E CONSULTORIA CONTABIL LTDA","12 MESES","90/2021","2021-06-16","2024-08-18","2025-08-18","56.000,00                     8.000,00 mensal","5º ADITIVO TEMPO"]
["dispensa 2/2022",null,"Sistema do Controle Interno","ADM","BETEL SOLUÇÕES EM TI LTDA","09 MESES","046/2022","2022-03-29","2022-12-30","30/09/223","7.200,00                        800,00 mensais","1º ADITIVO TEMPO"]
["dispensa 2/2022",null,"Sistema do Controle Interno","ADM","BETEL SOLUÇÕES EM TI LTDA","12 MESES","046/2022","2022-03-29","2023-09-29","2024-09-29","7.200,00                        800,00 mensais","2º ADITIVO TEMPO"]
["PE 016/2022",null,"automação judicial","adm","COREPLAN GESTÃO TECNOLOGIA LTDA","12 MESES","124/2022","2023-08-19","2023-08-19","2024-08-19","143.832,00 11.986,00 mensais","1º ADITIVO TEMPO"]
["PE 016/2022",null,"automação judicial","adm","COREPLAN GESTÃO TECNOLOGIA LTDA","12 MESES","124/2022","2023-08-19","2024-08-19","2025-08-19","143.832,00                    11.986,00 mensais","2º ADITIVO TEMPO"]
["TP 03/2021",null,"Assessoria e Consultoria em Licitação","ADM","ABAS ADVOGADOS ASSOCIADOS","284 dias","45/2021","2023-03-22","2021-12-30","2022-10-12","300.000,00                  25.000,00 mensal","1º ADITIVO TEMPO "]
["TP 03/2021",null,"Assessoria e Consultoria em Licitação","ADM","ABAS ADVOGADOS ASSOCIADOS","284 dias","45/2021","2023-03-22","2022-10-12","2023-07-27","300.000,00             25.000,00 mensal","2º ADITIVO TEMPO "]
["TP 03/2021",null,"Assessoria e Consultoria em Licitação","ADM","ABAS ADVOGADOS ASSOCIADOS","12 MESES","45/2021","2023-03-22","2023-07-27","2024-07-27","300.000,00 25.000,00 mensal","3º ADITIVO TEMPO"]
["TP 03/2021",null,"Assessoria e Consultoria em Licitação","ADM","ABAS ADVOGADOS ASSOCIADOS","12 MESES","45/2021","2023-03-22","2024-07-26","2025-07-26","300.000,00             25.000,00 mensal","4º ADITIVO TEMPO"]
["TP 06/2024",null,"Assessoria e Consultoria tributaria ","ADM","C3 CONSULTORIA TRIBUTÁRIA LTDA","09 meses","71/2021","2021-04-05","2021-12-30","2022-09-30","48.000,00 4.000,00 mensal","1º ADITIVO TEMPO "]
["TP 06/2024",null,"Assessoria e Consultoria tributaria ","ADM","C3 CONSULTORIA TRIBUTÁRIA LTDA","09 meses","71/2021","2021-04-05","2022-09-30","2023-06-30","48.000,00                  4.000,00 mensal","2º ADITIVO TEMPO "]
["TP 06/2024",null,"Assessoria e Consultoria tributaria ","ADM","C3 CONSULTORIA TRIBUTÁRIA LTDA","09 meses","71/2021","2021-04-05","2023-06-30","2024-06-30","48.000,00                   4.000,00 mensal","3º ADITIVO TEMPO"]
["TP 06/2024",null,"Assessoria e Consultoria tributaria ","ADM","C3 CONSULTORIA TRIBUTÁRIA LTDA","06 MESES","71/2021","2021-04-05","2024-06-28","2024-12-29","48.000,00 4.000,00 mensal","4º ADITIVO TEMPO"]
["Adesão 010/2021",null,"assessoria em marketing","ADM","A R N BRITO LIMA ME","09 MESES","85/2021","2021-03-31","2021-12-30","2022-09-30","158.000,00                     15.800,00 mensal","1º ADITIVO TEMPO "]
["Adesão 010/2021",null,"assessoria em marketing","ADM","A R N BRITO LIMA ME","09 MESES","85/2021","2021-03-31","2022-09-30","2023-06-30","158.000,00               15.800,00 mensal","1º ADITIVO TEMPO "]
["Adesão 010/2021",null,"assessoria em marketing","ADM","A R N BRITO LIMA ME","09 MESES","85/2021","2021-03-31","2022-09-30","2023-06-30","158.000,00 15.800,00 mensal","2º ADITIVO TEMPO "]
["Adesão 010/2021",null,"assessoria em marketing","ADM","A R N BRITO LIMA ME","12 MESES","85/2021","2021-03-31","2023-06-30","2024-06-30","158.000,00               15.800,00 mensal","3º ADITIVO TEMPO"]
["Adesão 010/2021",null,"assessoria em marketing","ADM","A R N BRITO LIMA ME","12 MESES","85/2021","2021-03-31","2024-06-28","2025-06-28","158.000,00               15.800,00 mensal","4º ADITIVO TEMPO"]
["TP 004/2021",null,"Assesssoria Juridica","ADM","ALMEIDA FERREIRA E GONÇALVES ADVOGADOS","288 DIAS","44/2021","2021-03-18","2021-12-30","2022-10-15","360.000,00 30.000,00 MENSAL","1º ADITIVO TEMPO "]
["TP 004/2021",null,"Assesssoria Juridica","ADM","ALMEIDA FERREIRA E GONÇALVES ADVOGADOS","288 DIAS","44/2021","2021-03-18","2022-10-14","2023-07-28","360.000,00             30.000,00 MENSAL","2º ADITIVO TEMPO "]
["TP 004/2021",null,"Assesssoria Juridica","ADM","ALMEIDA FERREIRA E GONÇALVES ADVOGADOS","288 DIAS","44/2021","2021-03-18","2023-07-28","28/072023","360.000,00 30.000,00 MENSAL","3º ADITIVO TEMPO"]
["TP 004/2021",null,"Assesssoria Juridica","ADM","ALMEIDA FERREIRA E GONÇALVES ADVOGADOS","12 MESES ","44/2021","2021-03-18","2024-07-26","2025-07-26","360.000,00                    30.000,00 MENSAL","4º ADITIVO TEMPO"]
["TP 005/2021",null,"Software da contabilidade","ADM","ASP AUTOM. SERV. E PROD. DE INFORM. LTDA","09 MESES","070/2021","2021-04-05","2021-12-30","2022-09-30","53.570,00                   4870,00 mensal","1º ADITIVO TEMPO "]
["TP 005/2021",null,"Software da contabilidade","ADM","ASP AUTOM. SERV. E PROD. DE INFORM. LTDA","09 MESES","070/2021","2021-04-05","2022-09-30","2023-06-30","53.570,00                   4870,00 mensal","2º ADITIVO TEMPO "]
["TP 005/2021",null,"Software da contabilidade","ADM","ASP AUTOM. SERV. E PROD. DE INFORM. LTDA","12 MESES","070/2021","2021-04-05","2023-06-30","2024-06-30","53.570,00                   4870,00 mensal","3º ADITIVO TEMPO"]
{"$rows_left_out":51}